{"text_format":"1","workbook":"xlsx","n_sheets":6,"sheets":["Příkaz","Vyúčtování test","Vyúčtování","Zpráva o cestě","Kurzy CNB","List1"],"not_rendered":{"charts":3,"images":1,"macros":1,"external_links":0,"defined_names":6,"comments":4,"pivot_tables":0},"unopened":[],"bounds":{"document_bytes":16777216,"sheet_cells":100000,"rows_first":2000,"rows_last":500,"rows_between":2000,"halvings":0,"cell_chars":16384,"cell_head_chars":4096},"cells_cut":0,"cells_raw":0,"read":"whole","date_system":"1900"}

{"sheet":"Příkaz","index":0,"n_rows":84,"n_cols":29,"rows_kept":84,"cut":false,"hidden":false,"merged":[[0,25,0,27],[38,7,38,9],[39,7,39,9],[38,14,38,16],[39,14,39,16],[17,5,17,17],[25,5,25,15],[27,5,27,15],[29,5,29,15],[14,9,14,17],[10,3,10,17],[12,1,12,3],[37,9,37,12],[10,1,10,2],[36,23,36,24],[12,4,12,17],[50,1,50,4],[50,5,50,8],[33,10,33,15],[42,1,43,17],[33,6,33,8],[46,1,46,2],[41,1,41,17],[37,14,37,17],[36,14,36,17],[33,1,33,5],[37,3,37,5],[36,9,36,10],[36,6,36,8],[36,1,36,2],[36,3,36,5],[58,2,58,17],[60,1,60,17],[83,1,83,7],[75,1,75,7],[75,10,75,17],[79,10,79,17],[83,10,83,17],[79,1,79,7],[65,1,72,17],[63,1,63,3],[54,1,54,6],[54,7,54,8],[63,9,63,17],[62,1,62,3],[44,5,44,17],[44,1,44,2],[46,5,46,17],[48,1,48,2],[48,5,48,7],[48,9,48,10],[48,11,48,17],[52,1,52,3],[52,5,52,17],[50,13,50,17],[50,9,50,12],[56,2,57,17],[31,1,31,3],[31,5,31,17],[29,1,29,2],[17,1,17,2],[19,1,19,5],[21,1,21,15],[19,8,19,12],[19,13,19,15],[25,1,25,2],[27,1,27,2],[23,1,23,9],[23,10,23,17],[0,10,0,17],[4,1,4,2],[4,3,4,9],[4,11,4,17],[6,5,6,6],[6,7,6,8],[6,9,6,17],[14,1,14,2],[14,5,14,6],[14,7,14,8],[1,1,1,17],[8,1,8,2],[8,3,8,17]]}
[null,null,null,null,null,null,null,null,null,null,"Příloha OD  č. 1/2022\n\nEvidenční číslo:",null,null,null,null,null,null,null,null,null,null,null,null,null,null,{"$f":"IFERROR(\"Vyúčtování pracovní cesty a zprávu o pracovní cestě je nutné odevzdat nejpozději do \" &TEXT(List1!$AC$1,\"dd.mm.rrrr\")&\".\",\"\")","v":""}]
[null,"CESTOVNÍ  PŘÍKAZ K USKUTEČNĚNÍ ZAHRANIČNÍ PRACOVNÍ CESTY"]
[]
[]
[null,"Jméno a příjmení:",null,null,null,null,null,null,null,null,"Pracoviště:"]
[]
[null,"Zahájení cesty",null,"Datum:",null,null,null,"Místo:",null,null,null,null,null,null,null,null,null,null,null,null,null,null,null,null,null,null,null,null,{"$f":"D18&D26&D28&D30","v":""}]
[]
[null,"Místo konání:",null,null,null,null,null,null,null,null,null,null,null,null,null,null,null,null,null,null,null,null,null,"Stát, místo, pořadatel",null,null,null,null,"PF UKPF UKPF UKPF UK"]
[]
[null,"Název akce/Účel:"]
[]
[null,"Očekávaný přínos/výstup:"]
[]
[null,"Ukončení cesty",null,"Datum:",null,null,null,"Místo:"]
{"$rows_left_out":70}
{"sheet":"Vyúčtování test","index":1,"n_rows":56,"n_cols":33,"rows_kept":56,"cut":false,"hidden":true,"merged":[[18,20,19,20],[16,13,17,13],[16,17,17,17],[17,3,17,4],[18,1,19,1],[18,3,18,4],[18,6,19,6],[18,7,19,7],[18,9,19,9],[16,6,17,6],[16,7,17,7],[16,9,17,9],[16,10,17,10],[16,11,17,11],[18,19,19,19],[18,12,19,12],[19,3,19,4],[16,8,17,8],[18,8,19,8],[16,1,17,1],[16,3,16,4],[14,20,15,20],[16,20,17,20],[1,1,1,17],[2,1,3,1],[2,3,3,4],[2,6,3,6],[2,7,3,7],[2,8,3,8],[12,12,13,12],[16,12,17,12],[12,13,13,13],[12,17,13,17],[13,3,13,4],[14,1,15,1],[14,3,14,4],[14,6,15,6],[14,7,15,7],[14,9,15,9],[14,10,15,10],[12,3,12,4],[12,6,13,6],[12,7,13,7],[12,9,13,9],[12,10,13,10],[4,20,5,20],[6,20,7,20],[8,20,9,20],[10,20,11,20],[12,20,13,20],[4,10,5,10],[4,11,5,11],[4,12,5,12],[4,13,5,13],[4,17,5,17],[4,19,5,19],[10,10,11,10],[10,11,11,11],[10,12,11,12],[10,13,11,13],[14,8,15,8],[10,17,11,17],[18,13,19,13],[18,17,19,17],[5,3,5,4],[6,13,7,13],[6,17,7,17],[8,10,9,10],[8,11,9,11],[8,12,9,12],[8,13,9,13],[8,17,9,17],[9,3,9,4],[6,12,7,12],[7,3,7,4],[4,8,5,8],[6,10,7,10],[6,11,7,11],[11,3,11,4],[10,3,10,4],[10,6,11,6],[10,7,11,7],[10,9,11,9],[10,8,11,8],[55,9,56,17],[44,1,44,8],[48,9,48,17],[46,1,47,8],[49,9,49,17],[23,7,23,10],[34,1,34,4],[41,1,41,4],[51,1,51,5],[55,1,55,5],[30,1,31,4],[29,5,30,8],[31,7,31,8],[24,10,24,13],[4,1,5,1],[4,3,4,4],[4,6,5,6],[4,7,5,7],[4,9,5,9],[6,1,7,1],[6,3,6,4],[6,6,7,6],[6,7,7,7],[6,9,7,9],[6,8,7,8],[24,24,24,26],[16,19,17,19],[14,19,15,19],[12,19,13,19],[10,19,11,19],[8,19,9,19],[6,19,7,19],[8,1,9,1],[8,3,8,4],[8,6,9,6],[8,7,9,7],[8,9,9,9],[8,8,9,8],[18,10,19,10],[18,11,19,11],[14,13,15,13],[12,1,13,1],[12,11,13,11],[14,11,15,11],[14,12,15,12],[14,17,15,17],[15,3,15,4],[12,8,13,8],[10,1,11,1]]}
[]
[null,"VYÚČTOVÁNÍ PRACOVNÍ CESTY"]
[null,"Datum",null,"Odjezd - příjezd",null,null,"Použitý dopr. prostředek2)","Vzdálenost\nv km 1)","Jízdné v případě AUV","Jízdné a místní přeprava","Stravné","Noc-\nležné","Nutné\nvedlejší výdaje","Celkem",null,null,null,"Upraveno"]
[null,null,null,null,null,"v hod.",null,null,null,"Kč","Kč","Kč","Kč","Kč",null,null,null,"Kč",null,null,null,null,null,null,"Vozidlo"]
[null,"2020-01-02","Odjezd",null,null,"10:00:00",null,null,{"$f":"IF(G5=\"VV\",ROUND(H5*$Z$14+H5*$Z$18,2),\"\")","v":""},null,{"$f":"R26","v":691},null,null,{"$f":"(N(I5)+J5+L5+M5)","v":0},null,null,{"$f":"VLOOKUP(P27,$AC$12:$AG$16,Q27+1,FALSE)","v":91},null,null,{"$f":"IF(B5=\"\",\"\",IF(B7=\"\",\"konec\",\"průběh\"))","v":"průběh"},{"$f":"VLOOKUP(IF(B5=\"\",0,(IF(B5=B3,1000,100)+IF(B5=B7,10,1))),List1!$B$22:$D$26,3,FALSE)","v":4},{"$f":"B5","v":"2020-01-02"},{"$f":"IF(V5<>0,B5+F5,\"\")","v":"2020-01-02T10:00:00"},null,"SPZ"]
[null,null,"Příjezd",null,null,"12:00:00",null,null,null,null,null,null,null,null,null,null,null,null,null,null,null,{"$f":"B5","v":"2020-01-02"},{"$f":"IF(V5<>0,B5+F6,\"\")","v":"2020-01-02T12:00:00"},null,"Palivo","nafta",null,null,null,{"$f":"AD8","v":43832}]
[null,"2020-01-05","Odjezd",null,null,"15:00:00",null,null,{"$f":"IF(G7=\"VV\",ROUND(H7*$Z$14+H7*$Z$18,2),\"\")","v":""},null,null,null,null,{"$f":"(N(I7)+J7+L7+M7)","v":0},null,null,{"$f":"VLOOKUP(P28,$AC$12:$AG$16,Q28+1,FALSE)","v":200},null,null,{"$f":"IF(B7=\"\",\"\",IF(B9=\"\",\"konec\",\"průběh\"))","v":"konec"},{"$f":"VLOOKUP(IF(B7=\"\",0,(IF(B7=B5,1000,100)+IF(B7=B9,10,1))),List1!$B$22:$D$26,3,FALSE)","v":4},{"$f":"B7","v":"2020-01-05"},{"$f":"IF(V7<>0,B7+F7,\"\")","v":"2020-01-05T15:00:00"},null,"spotřeba 1",3.1]
[null,null,"Příjezd",null,null,"20:00:00",null,null,null,null,null,null,null,null,null,null,null,null,null,null,null,{"$f":"B7","v":"2020-01-05"},{"$f":"IF(V7<>0,B7+F8,\"\")","v":"2020-01-05T20:00:00"},null,"spotřeba 2",null,null,null,null,{"$f":"MIN(B5:B20)","v":"2020-01-02"},{"$f":"MIN(W5:W20)","v":"2020-01-02T10:00:00"}]
[null,null,"Odjezd",null,null,null,null,null,{"$f":"IF(G9=\"VV\",ROUND(H9*$Z$14+H9*$Z$18,2),\"\")","v":""},null,null,null,null,{"$f":"(N(I9)+J9+L9+M9)","v":0},null,null,null,null,null,{"$f":"IF(B9=\"\",\"\",IF(B11=\"\",\"konec\",\"průběh\"))","v":""},{"$f":"VLOOKUP(IF(B9=\"\",0,(IF(B9=B7,1000,100)+IF(B9=B11,10,1))),List1!$B$22:$D$26,3,FALSE)","v":5},{"$f":"B9","v":"00:00:00"},{"$f":"IF(V9<>0,B9+F9,\"\")","v":""},null,"spotřeba 3",null,null,null,null,{"$f":"MAX(B5:B20)","v":"2020-01-05"},{"$f":"MAX(W5:W20)","v":"2020-01-05T20:00:00"}]
[null,null,"Příjezd",null,null,null,null,null,null,null,null,null,null,null,null,null,null,null,null,null,null,{"$f":"B9","v":"00:00:00"},{"$f":"IF(V9<>0,B9+F10,\"\")","v":""},null,"spotřeba 4"]
[null,null,"Odjezd",null,null,null,null,null,{"$f":"IF(G11=\"VV\",ROUND(H11*$Z$14+H11*$Z$18,2),\"\")","v":""},null,null,null,null,{"$f":"(N(I11)+J11+L11+M11)","v":0},null,null,null,null,null,{"$f":"IF(B11=\"\",\"\",IF(B13=\"\",\"konec\",\"průběh\"))","v":""},{"$f":"VLOOKUP(IF(B11=\"\",0,(IF(B11=B9,1000,100)+IF(B11=B13,10,1))),List1!$B$22:$D$26,3,FALSE)","v":5},{"$f":"B11","v":"00:00:00"},{"$f":"IF(V11<>0,B11+F11,\"\")","v":""},null,"Průměr - použitá spotřeba",{"$f":"ROUND(AVERAGE(Z7:Z10),2)","v":3.1},null,null,null,"0 - 5 hod","5 až 12 hod.","12 až 18 hod.","více než 18 hod."]
[null,null,"Příjezd",null,null,null,null,null,null,null,null,null,null,null,null,null,null,null,null,null,null,{"$f":"B11","v":"00:00:00"},{"$f":"IF(V11<>0,B11+F12,\"\")","v":""},null,"Cena paliva z dokladu",null,"Pokud nezadáte cenu paliva z dokladu, bude použita cena z vyhlášky",null,"počet jídel",0,"I","II","III"]
[null,null,"Odjezd",null,null,null,null,null,{"$f":"IF(G13=\"VV\",ROUND(H13*$Z$14+H13*$Z$18,2),\"\")","v":""},null,null,null,null,{"$f":"(N(I13)+J13+L13+M13)","v":0},null,null,null,null,null,{"$f":"IF(B13=\"\",\"\",IF(B15=\"\",\"konec\",\"průběh\"))","v":""},{"$f":"VLOOKUP(IF(B13=\"\",0,(IF(B13=B11,1000,100)+IF(B13=B15,10,1))),List1!$B$22:$D$26,3,FALSE)","v":5},{"$f":"B13","v":"00:00:00"},{"$f":"IF(V13<>0,B13+F13,\"\")","v":""},null,"Náhrady",null,null,null,0,0,90,140,200]
[null,null,"Příjezd",null,null,null,null,null,null,null,null,null,null,null,null,null,null,null,null,null,null,{"$f":"B13","v":"00:00:00"},{"$f":"IF(V13<>0,B13+F14,\"\")","v":""},null,"amortizace za km",4.0999999999999996,null,null,1,0,{"$f":"AE13*0.3","v":27},{"$f":"0.65*AF13","v":91},{"$f":"0.75*AG13","v":150}]
[null,null,"Odjezd",null,null,null,null,null,{"$f":"IF(G15=\"VV\",ROUND(H15*$Z$14+H15*$Z$18,2),\"\")","v":""},null,null,null,null,{"$f":"(N(I15)+J15+L15+M15)","v":0},null,null,null,null,null,{"$f":"IF(B15=\"\",\"\",IF(B17=\"\",\"konec\",\"průběh\"))","v":""},{"$f":"VLOOKUP(IF(B15=\"\",0,(IF(B15=B13,1000,100)+IF(B15=B17,10,1))),List1!$B$22:$D$26,3,FALSE)","v":5},{"$f":"B15","v":"00:00:00"},{"$f":"IF(V15<>0,B15+F15,\"\")","v":""},null,"benzin 95 oktanů",33.1,null,null,2,0,0,{"$f":"0.3*AF13","v":42},{"$f":"0.5*AG13","v":100}]
{"$rows_left_out":42}
{"sheet":"Vyúčtování","index":2,"n_rows":60,"n_cols":46,"rows_kept":60,"cut":false,"hidden":false,"merged":[[37,1,37,6],[38,1,39,4],[41,1,43,8],[59,5,61,9],[59,1,61,3],[55,1,56,3],[46,1,47,8],[55,5,56,8],[50,1,51,3],[50,5,50,8],[21,9,22,9],[23,3,23,4],[19,3,19,4],[29,1,29,6],[26,1,27,2],[26,3,26,4],[27,3,27,4],[21,3,21,4],[22,3,22,4],[25,3,25,4],[20,3,20,4],[24,3,24,4],[11,7,11,8],[16,5,16,6],[34,1,35,8],[33,1,33,8],[19,1,19,2],[30,1,30,6],[2,1,2,3],[2,4,2,10],[28,36,28,38],[7,6,7,10],[6,31,7,31],[9,1,9,3],[6,32,7,32],[9,6,9,10],[9,18,9,19],[20,1,23,2],[24,1,25,2],[16,1,16,2],[28,1,28,6],[19,10,19,14],[24,10,24,14],[6,1,6,3],[0,45,0,49],[6,26,9,28],[0,8,0,14],[8,6,8,12],[7,38,9,50],[4,32,5,32],[4,31,5,31],[8,18,8,19],[1,1,1,14],[3,13,3,14],[7,1,7,3],[4,13,4,14],[4,1,4,3],[4,4,4,10],[6,6,6,10],[5,13,6,14],[18,1,18,14],[10,10,10,14],[15,12,15,14],[3,1,3,3],[3,4,3,10],[8,13,8,14],[15,1,15,2],[15,9,15,10],[16,9,16,10],[5,6,5,10],[15,5,15,6],[13,1,13,3],[8,1,8,3],[11,1,11,3],[10,1,10,3],[9,13,9,14]]}
[null,null,null,null,null,null,null,null,"Příloha OD  č. 1/2022",null,null,null,null,null,null,null,null,null,null,null,null,null,null,null,null,null,null,{"$f":"\"Kurzy ČNB jsou aktualizovány k \"&TEXT(AN2,\"dd.mm.rrrr\")","v":"Kurzy ČNB jsou aktualizovány k 06.01.2023"},null,null,null,null,null,null,{"$f":"60*60*24","v":86400},null,null,null,null,null,null,null,null,null,null,{"$f":"IFERROR(\"Vyúčtování pracovní cesty a zprávu o pracovní cestě je nutné odevzdat nejpozději do \" &TEXT(List1!$AC$1,\"dd.mm.rrrr\")&\".\",\"\")","v":""}]
[null,"VYÚČTOVÁNÍ ZAHRANIČNÍ PRACOVNÍ CESTY",null,null,null,null,null,null,null,null,null,null,null,null,null,null,null,null,null,null,null,null,null,null,null,null,null,null,null,null,null,null,null,null,null,null,null,null,null,{"$f":"(MAX('Kurzy CNB'!$A$2:$A$370))","v":"2023-01-06"}]
[null,"Jméno a příjmení",null,null,{"$f":"T(Příkaz!D5)","v":""}]
[null,"Název akce/Účel:",null,null,{"$f":"T(Příkaz!D11)","v":""},null,null,null,null,null,null,null,null,"stát",null,null,null,null,null,null,null,null,null,null,null,null,null,null,null,null,null,null,null,null,null,null,"Vozidlo"]
[null,"Místo konání akce",null,null,{"$f":"T(Příkaz!D9)","v":""},null,null,null,null,null,null,null,null,null,null,null,null,null,null,null,null,null,null,null,null,null,null,null,null,null,null,null,null,null,null,null,"SPZ"]
[null,null,null,null,"datum","čas","místo",null,null,null,null,null,null,"základní sazba zahraničního stravného",null,null,null,null,null,null,null,null,null,null,null,null,null,null,null,null,null,null,null,null,null,null,"Palivo","benzin 95 oktanů",null,null,null,{"$f":"AP8","v":0}]
[null,"Zahájení cesty",null,null,"2023-01-03","07:00:00",null,null,null,null,null,null,null,null,null,null,null,null,{"$f":"E7+F7","v":"2023-01-03T07:00:00"},null,null,null,null,null,null,null,"Neposkytnutí náhrady cestovních výdajů\n dle čl.15 OD 1/2022 v případě, že byla zaměstnanci poskytnuta náhrada v zahraničí nebo z jiného zdroje",null,null,null,null,null,null,null,null,null,"spotřeba 1",4,"Doplňte kombinovanou spotřebu dle norem EU z TP a ostatní pole ponechte prázdné"]
[null,"Překročení státní hranice/odlet",null,null,"2023-01-03","07:00:00",{"$f":"IF(S8<S7,\"překročení hranice nemůže být před začátkem cesty\",\"\")","v":""},null,null,null,null,null,null,{"$f":"IFERROR(VLOOKUP(N5,List1!V3:Y180,4,FALSE),\"Vyberte\")","v":"Vyberte"},{"$f":"IFERROR(VLOOKUP(N5,List1!V3:Y180,2,FALSE),\"stát\")","v":"stát"},null,null,null,{"$f":"E8+F8","v":"2023-01-03T07:00:00"},null,null,null,null,null,null,null,null,null,null,null,null,null,null,null,null,null,"spotřeba 2",null,"Pokud údaj o kombinované spotřebě v technickém průkazu není, vypočte se spotřeba PHM vozidla aritmetickým průměrem ze všech údajů o spotřebě uvedených v technickém průkazu."]
[null,"Překročení státní hranice/přílet",null,null,"2023-01-04","23:00:00",{"$f":"IF(OR(E7>MAX('Kurzy CNB'!A2:A370),E16>MAX('Kurzy CNB'!A2:A370)),\"Začátek cesty nebo datum zálohy je v období mimo načtené kurzy ČNB\",\"\")","v":""},null,null,null,null,null,null,"použit kurz ze dne",null,null,null,null,{"$f":"E9+F9","v":"2023-01-04T23:00:00"},null,null,null,null,null,null,null,null,null,null,null,null,null,null,null,null,null,"spotřeba 3"]
[null,"Ukončení cesty",null,null,"2023-01-04","23:00:00",null,null,null,null,null,null,null,{"$f":"IF(AND(E16<>\"\",E14<>\"NE\",OR(F16<>\"\",F17<>\"\")),E16,E7)","v":"2023-01-03"},null,null,null,null,{"$f":"E10+F10","v":"2023-01-04T23:00:00"},null,null,null,null,null,null,null,null,null,null,null,null,null,null,null,null,null,"spotřeba 4"]
[null,"Strava poskytnuta bezplatně",null,null,"Ne",null,"Celková vzdálenost v km  při použití VV",null,null,null,"Poskytnuté náhrady za výdaje:",null,null,null,null,null,null,null,null,null,null,null,null,null,null,null,"nárok","náhrada","k vyúčtování",null,null,null,null,null,null,null,"Průměr - použitá spotřeba",{"$f":"ROUND(AVERAGE(AL7:AL10),2)","v":4},null,null,null,"0 - 5 hod","5 až 12 hod.","12 až 18 hod.","více než 18 hod."]
[null,"Použitý dopr. prostředek",null,null,"A",null,null,{"$f":"IF(E12=\"VV\",CEILING(G12*$AL$16+G12*$AL$21,0.01),\"\")","v":""},null,null,"ubytování",null,"EUR",null,{"$f":"IF(N12<>\"\",IF(M12<>\"\",(IF(M12=\"CZK\",1,VLOOKUP($N$10,'Kurzy CNB'!$A$1:$AJ$315,VLOOKUP(M12,List1!$S$4:$T$36,2,FALSE),TRUE)))*N12/VLOOKUP(M12,List1!$S$3:$U$36,3,FALSE),0),0)","v":0},null,null,null,null,null,null,null,null,null,null,null,{"$f":"SUM(I25:I26)","v":0},{"$f":"O12","v":0},{"$f":"IF((AA12-AB12)<0,0,AA12-AB12)","v":0},null,null,null,null,null,null,null,"Cena paliva z dokladu",30,"CZK",null,"počet jídel",0,"I","II","III"]
[null,null,null,null,null,null,null,null,null,null,"jízdné",null,"EUR",null,{"$f":"IF(N13<>\"\",IF(M13<>\"\",(IF(M13=\"CZK\",1,VLOOKUP($N$10,'Kurzy CNB'!$A$1:$AJ$315,VLOOKUP(M13,List1!$S$4:$T$36,2,FALSE),TRUE)))*N13/VLOOKUP(M13,List1!$S$3:$U$36,3,FALSE),0),0)","v":0},null,null,null,null,null,null,null,null,null,null,null,{"$f":"SUM(I21:I24)","v":0},{"$f":"O13","v":0},{"$f":"IF((AA13-AB13)<0,0,AA13-AB13)","v":0},null,null,null,null,null,null,null,"Cena paliva z dokladu CZK",{"$f":"CEILING(IF(AL12<>\"\",IF(AM12<>\"\",(IF(AM12=\"CZK\",1,VLOOKUP($N$10,'Kurzy CNB'!$A$1:$AJ$315,VLOOKUP(AM12,List1!$S$4:$T$36,2,FALSE),TRUE)))*AL12/VLOOKUP(AM12,List1!$S$3:$U$36,3,FALSE),0),0),0.0001)","v":30},null,null,0,0,138,205,316]
[null,"Poskytnuta záloha",null,null,"Ne",null,"částka","měna","kurz ČNB",null,"ostatní",null,"EUR",null,{"$f":"IF(N14<>\"\",IF(M14<>\"\",(IF(M14=\"CZK\",1,VLOOKUP($N$10,'Kurzy CNB'!$A$1:$AJ$315,VLOOKUP(M14,List1!$S$4:$T$36,2,FALSE),TRUE)))*N14/VLOOKUP(M14,List1!$S$3:$U$36,3,FALSE),0),0)","v":0},null,null,null,null,null,null,null,null,null,null,null,{"$f":"SUM(I27:I28)","v":0},0,0,null,null,null,null,null,null,null,"Náhrady",null,null,null,1,0,{"$f":"AQ13*0.3","v":41.4},{"$f":"0.65*AR13","v":133.25},{"$f":"0.75*AS13","v":237}]
[]
{"$rows_left_out":46}
{"sheet":"Zpráva o cestě","index":3,"n_rows":51,"n_cols":21,"rows_kept":51,"cut":false,"hidden":false,"merged":[[21,1,29,16],[32,1,46,16],[49,1,49,3],[50,1,50,3],[50,9,50,16],[20,1,20,5],[7,1,7,4],[9,1,9,4],[9,5,9,17],[11,5,11,17],[13,1,13,4],[15,1,15,3],[15,5,15,6],[7,5,7,6],[13,5,13,6],[17,10,17,16],[15,7,15,17],[17,1,17,5],[17,7,17,8],[1,20,5,28],[7,8,7,16],[13,8,13,17],[0,10,0,15],[1,1,1,17],[3,1,3,4],[3,5,3,17],[5,1,5,4],[5,5,5,17]]}
[null,null,null,null,null,null,null,null,null,null,"Příloha OD  č. 1/2022\n\n"]
[null,"ZPRÁVA O PRŮBĚHU A VÝSLEDCÍCH  PRACOVNÍ CESTY",null,null,null,null,null,null,null,null,null,null,null,null,null,null,null,null,null,null,{"$f":"IFERROR(\"Vyúčtování pracovní cesty a zprávu o pracovní cestě je nutné odevzdat nejpozději do \" &TEXT(List1!$AC$1,\"dd.mm.rrrr\")&\".\",\"\")","v":""}]
[]
[null,"Jméno a příjmení:",null,null,null,{"$f":"T(Příkaz!D5)","v":""}]
[]
[null,"Pracoviště:",null,null,null,{"$f":"T(Příkaz!L5)","v":""}]
[]
[null,"Datum a místo zahájení cesty:",null,null,null,{"$f":"T(Příkaz!F7)","v":""},null,null,{"$f":"T(Příkaz!J7)","v":""}]
[]
[null,"Místo konání:",null,null,null,{"$f":"T(Příkaz!D9)","v":""}]
[]
[null,"Účel:",null,null,null,{"$f":"T(Příkaz!D11)","v":""}]
[]
[null,"Datum a místo ukončení cesty:",null,null,null,{"$f":"T(Příkaz!F15)","v":""},null,null,{"$f":"T(Příkaz!J15)","v":""}]
[]
{"$rows_left_out":37}
{"sheet":"Kurzy CNB","index":4,"n_rows":6,"n_cols":32,"rows_kept":6,"cut":false,"hidden":false,"merged":[]}
["Datum","1 AUD","1 BGN","1 BRL","1 CAD","1 CHF","1 CNY","1 DKK","1 EUR","1 GBP","1 HKD","100 HUF","1000 IDR","1 ILS","100 INR","100 ISK","100 JPY","100 KRW","1 MXN","1 MYR","1 NOK","1 NZD","100 PHP","1 PLN","1 RON","1 SEK","1 SGD","100 THB","1 TRY","1 USD","1 XDR","1 ZAR"]
["2023-01-02",15.4,12.385,4.2370000000000001,16.667999999999999,24.495999999999999,3.2810000000000001,3.25,24.175000000000001,27.271999999999998,2.899,6.0279999999999996,1.4530000000000001,6.4470000000000001,27.341000000000001,15.936,17.317,1.7809999999999999,1.1599999999999999,5.1369999999999996,2.2989999999999999,14.317,40.540999999999997,5.1639999999999997,4.8940000000000001,2.165,16.878,65.491,1.2090000000000001,22.63,30.117999999999999,1.33]
["2023-01-03",15.358000000000001,12.335000000000001,4.2590000000000003,16.738,24.422000000000001,3.3109999999999999,3.2440000000000002,24.125,27.401,2.9279999999999999,5.98,1.4670000000000001,6.4829999999999997,27.6,15.903,17.484999999999999,1.792,1.175,5.1920000000000002,2.2919999999999998,14.250999999999999,40.875999999999998,5.1520000000000001,4.8929999999999998,2.165,17.006,66.548000000000002,1.2210000000000001,22.878,30.446999999999999,1.339]
["2023-01-04",15.55,12.284000000000001,4.1609999999999996,16.728999999999999,24.408999999999999,3.2930000000000001,3.23,24.024999999999999,27.276,2.9,6.069,1.454,6.4260000000000002,27.372,15.837,17.315999999999999,1.7809999999999999,1.175,5.1520000000000001,2.2370000000000001,14.323,40.500999999999998,5.1470000000000002,4.8769999999999998,2.1520000000000001,16.907,66.658000000000001,1.21,22.672000000000001,30.148,1.347]
["2023-01-05",15.483000000000001,12.28,4.2089999999999996,16.795000000000002,24.4,3.3,3.2309999999999999,24.03,27.218,2.9039999999999999,6.0529999999999999,1.4530000000000001,6.4269999999999996,27.481000000000002,15.778,17.047000000000001,1.786,1.17,5.1680000000000001,2.2410000000000001,14.275,40.616999999999997,5.1459999999999999,4.88,2.1480000000000001,16.914000000000001,66.846000000000004,1.208,22.675999999999998,30.266999999999999,1.3260000000000001]
["2023-01-06",15.43,12.298999999999999,4.2939999999999996,16.786000000000001,24.387,3.34,3.2349999999999999,24.055,27.189,2.9329999999999998,6.0570000000000004,1.466,6.44,27.678999999999998,15.733000000000001,17.026,1.7989999999999999,1.1870000000000001,5.2030000000000003,2.226,14.241,41.204999999999998,5.1239999999999997,4.8789999999999996,2.137,16.992999999999999,67.322000000000003,1.2210000000000001,22.911000000000001,30.548999999999999,1.32]

{"sheet":"List1","index":5,"n_rows":569,"n_cols":31,"rows_kept":569,"cut":false,"hidden":true,"merged":[]}
[null,null,null,null,null,null,null,"2023-01-01","2023-01-01",null,null,null,null,null,null,"počet dní",null,null,null,null,null,null,null,null,null,null,null,{"$f":"Příkaz!F15","v":"00:00:00"},{"$f":"VLOOKUP(VLOOKUP(AB1,AB3:AD569,3,FALSE)+10,AA3:AB569,2,FALSE)","v":{"$error":"#N/A"}}]
[1,null,null,null,null,null,null,"2023-12-31","2024-06-30",null,"Ano","JE","PF UK","ZO PF UK",null,{"$f":"Příkaz!F15-Příkaz!F7+1","v":1},{"$f":"VALUE(RIGHT(P2,1))","v":1},{"$f":"P2&\" \"&VLOOKUP(Q2,P6:Q15,2,FALSE)","v":"1 den"},null,null,null,"Země","Měnový kód","Měna","Základní sazby zahraničního stravného",null,"poř","datum","body","č2","den"]
[2,"V","Vlak",null,null,null,null,null,null,null,"Ne","NENÍ","grant","jinak",null,null,null,"CZK","CZK",0,1,"Afghánistán","EUR","euro",45,null,0,"2023-01-01",0,null,{"$f":"WEEKDAY(AB3,2)","v":7}]
[3,"A","Autobus",null,null,null,null,null,"CZK",null,null,null,"jiné",null,null,null,null,"EUR","AUD",2,1,"Albánie","EUR","euro",40,null,{"$f":"AA3+AC4","v":1},"2023-01-02",1,{"$f":"AA3+AC4","v":1},{"$f":"WEEKDAY(AB4,2)","v":1}]
[4,"L","Letadlo",null,null,null,null,null,"EUR",null,"Ne",null,null,null,null,null,null,"GBP","BGN",3,1,"Alžírsko","EUR","euro",50,null,2,"2023-01-03",1,{"$f":"AA4+AC5","v":2},2]
[5,"SV","Služební silniční vozidlo",null,null,null,null,null,"USD",null,"Ano, v hotovosti",null,null,"ZO PF UK",null,0,"dní","PLN","BRL",4,1,"Andorra","EUR","euro",45,null,3,"2023-01-04",1,3,3]
[6,"SJ","Spolujízda",null,null,null,null,null,"GBP",null,"Ano, na bank. účet",null,null,"vyjíždějící",null,1,"den","USD","CAD",5,1,"Angola","USD","americký dolar",60,null,4,"2023-01-05",1,4,4]
[7,"VV","Vlastní silniční vozidlo - náhrada za každý km jízdy",null,null,null,null,null,"AUD",null,null,null,null,null,null,2,"dny",null,"CHF",6,1,"Argentina","USD","americký dolar",50,null,5,"2023-01-06",1,5,5]
[8,"V - VV","Vlastní vozidlo s náhradou výdajů za vlak",null,null,null,null,null,"BRL",null,null,null,null,null,null,3,"dny",null,"CNY",7,1,"Arménie","EUR","euro",40,null,5,"2023-01-07",0,5,6]
[9,"A - VV","Vlastní vozidlo s náhradou výdajů za autobus",null,null,null,null,null,"BGN",null,null,null,null,null,null,4,"dny",null,"DKK",8,1,"Austrálie a Oceánie – ostrovní státy1) ","USD","americký dolar",65,null,5,"2023-01-08",0,5,7]
[10,"L - VV","Vlastní vozidlo s náhradou výdajů za letadlo",null,null,null,null,null,"CNY",null,null,null,null,null,null,5,"dní",null,"EUR",9,1,"Ázerbájdžán","EUR","euro",40,null,6,"2023-01-09",1,6,1]
[11,null,null,null,null,null,null,null,"DKK",null,null,null,null,null,null,6,"dní",null,"GBP",10,1,"Bahamy","USD","americký dolar",60,null,7,"2023-01-10",1,7,2]
[12,"S",null,null,null,null,null,null,"PHP",null,null,null,null,null,null,7,"dní",null,"HKD",11,1,"Bahrajn","EUR","euro",45,null,8,"2023-01-11",1,8,3]
[13,"O",null,null,null,null,null,null,"HKD",null,null,null,null,null,null,8,"dní",null,"HUF",12,100,"Bangladéš","USD","americký dolar",50,null,9,"2023-01-12",1,9,4]
[14,"V",null,null,null,null,null,null,"HRK",null,null,null,null,null,null,9,"dní",null,"IDR",13,1000,"Belgie","EUR","euro",50,null,10,"2023-01-13",1,10,5]
{"$rows_left_out":554}