{"text_format":"1","workbook":"xlsx","n_sheets":5,"sheets":["Příkaz","Vyúčtování test","Vyúčtování","Kurzy CNB","List1"],"not_rendered":{"charts":0,"images":1,"macros":1,"external_links":0,"defined_names":4,"comments":3,"pivot_tables":0},"unopened":[],"bounds":{"document_bytes":16777216,"sheet_cells":100000,"rows_first":2000,"rows_last":500,"rows_between":2000,"halvings":0,"cell_chars":16384,"cell_head_chars":4096},"cells_cut":0,"cells_raw":0,"read":"whole","date_system":"1900"}

{"sheet":"Příkaz","index":0,"n_rows":78,"n_cols":26,"rows_kept":78,"cut":false,"hidden":false,"merged":[[33,23,33,24],[45,1,45,4],[45,5,45,8],[31,10,31,15],[37,1,38,17],[31,6,31,8],[41,1,41,2],[36,1,36,17],[34,14,34,17],[33,14,33,17],[31,1,31,5],[34,3,34,5],[53,2,53,17],[54,1,54,17],[77,1,77,7],[69,1,69,7],[69,10,69,17],[73,10,73,17],[77,10,77,17],[73,1,73,7],[59,1,66,17],[57,1,57,3],[49,1,49,6],[49,7,49,8],[57,9,57,17],[56,1,56,3],[39,5,39,17],[39,1,39,2],[41,5,41,17],[43,1,43,2],[43,5,43,7],[43,9,43,10],[43,11,43,17],[47,1,47,3],[47,5,47,17],[45,13,45,17],[45,9,45,12],[51,2,52,17],[11,4,11,17],[33,9,33,10],[33,6,33,8],[33,1,33,2],[33,3,33,5],[17,8,17,12],[17,13,17,15],[23,1,23,2],[25,1,25,2],[21,1,21,9],[21,10,21,17],[29,1,29,3],[29,5,29,17],[27,3,27,15],[27,1,27,2],[23,3,23,15],[13,9,13,17],[15,3,15,17],[15,1,15,2],[17,1,17,5],[19,1,19,15],[0,10,0,17],[25,3,25,15],[3,1,3,2],[3,3,3,9],[3,11,3,17],[5,5,5,6],[5,7,5,8],[5,9,5,17],[13,1,13,2],[13,5,13,6],[13,7,13,8],[1,1,1,17],[7,1,7,2],[7,3,7,17],[9,3,9,17],[11,1,11,3]]}
[null,null,null,null,null,null,null,null,null,null,"Příloha OD  č. 2/2020\n\nEvidenční číslo:"]
[null,"CESTOVNÍ  PŘÍKAZ K USKUTEČNĚNÍ ZAHRANIČNÍ PRACOVNÍ CESTY"]
[]
[null,"Jméno a příjmení:",null,null,null,null,null,null,null,null,"Útvar:"]
[]
[null,"Zahájení cesty",null,"Datum:",null,null,null,"Místo:"]
[]
[null,"Místo konání:",null,null,null,null,null,null,null,null,null,null,null,null,null,null,null,null,null,null,null,null,null,"Stát, místo, pořadatel"]
[]
[null,"Účel:"]
[]
[null,"Očekávaný přínos/výstup:"]
[]
[null,"Ukončení cesty",null,"Datum:",null,null,null,"Místo:"]
[]
{"$rows_left_out":64}
{"sheet":"Vyúčtování test","index":1,"n_rows":56,"n_cols":33,"rows_kept":56,"cut":false,"hidden":true,"merged":[[18,20,19,20],[16,13,17,13],[16,17,17,17],[17,3,17,4],[18,1,19,1],[18,3,18,4],[18,6,19,6],[18,7,19,7],[18,9,19,9],[16,6,17,6],[16,7,17,7],[16,9,17,9],[16,10,17,10],[16,11,17,11],[18,19,19,19],[18,12,19,12],[19,3,19,4],[16,8,17,8],[18,8,19,8],[16,1,17,1],[16,3,16,4],[14,20,15,20],[16,20,17,20],[1,1,1,17],[2,1,3,1],[2,3,3,4],[2,6,3,6],[2,7,3,7],[2,8,3,8],[12,12,13,12],[16,12,17,12],[12,13,13,13],[12,17,13,17],[13,3,13,4],[14,1,15,1],[14,3,14,4],[14,6,15,6],[14,7,15,7],[14,9,15,9],[14,10,15,10],[12,3,12,4],[12,6,13,6],[12,7,13,7],[12,9,13,9],[12,10,13,10],[4,20,5,20],[6,20,7,20],[8,20,9,20],[10,20,11,20],[12,20,13,20],[4,10,5,10],[4,11,5,11],[4,12,5,12],[4,13,5,13],[4,17,5,17],[4,19,5,19],[10,10,11,10],[10,11,11,11],[10,12,11,12],[10,13,11,13],[14,8,15,8],[10,17,11,17],[18,13,19,13],[18,17,19,17],[5,3,5,4],[6,13,7,13],[6,17,7,17],[8,10,9,10],[8,11,9,11],[8,12,9,12],[8,13,9,13],[8,17,9,17],[9,3,9,4],[6,12,7,12],[7,3,7,4],[4,8,5,8],[6,10,7,10],[6,11,7,11],[11,3,11,4],[10,3,10,4],[10,6,11,6],[10,7,11,7],[10,9,11,9],[10,8,11,8],[55,9,56,17],[44,1,44,8],[48,9,48,17],[46,1,47,8],[49,9,49,17],[23,7,23,10],[34,1,34,4],[41,1,41,4],[51,1,51,5],[55,1,55,5],[30,1,31,4],[29,5,30,8],[31,7,31,8],[24,10,24,13],[4,1,5,1],[4,3,4,4],[4,6,5,6],[4,7,5,7],[4,9,5,9],[6,1,7,1],[6,3,6,4],[6,6,7,6],[6,7,7,7],[6,9,7,9],[6,8,7,8],[24,24,24,26],[16,19,17,19],[14,19,15,19],[12,19,13,19],[10,19,11,19],[8,19,9,19],[6,19,7,19],[8,1,9,1],[8,3,8,4],[8,6,9,6],[8,7,9,7],[8,9,9,9],[8,8,9,8],[18,10,19,10],[18,11,19,11],[14,13,15,13],[12,1,13,1],[12,11,13,11],[14,11,15,11],[14,12,15,12],[14,17,15,17],[15,3,15,4],[12,8,13,8],[10,1,11,1]]}
[]
[null,"VYÚČTOVÁNÍ PRACOVNÍ CESTY"]
[null,"Datum",null,"Odjezd - příjezd",null,null,"Použitý dopr. prostředek2)","Vzdálenost\nv km 1)","Jízdné v případě AUV","Jízdné a místní přeprava","Stravné","Noc-\nležné","Nutné\nvedlejší výdaje","Celkem",null,null,null,"Upraveno"]
[null,null,null,null,null,"v hod.",null,null,null,"Kč","Kč","Kč","Kč","Kč",null,null,null,"Kč",null,null,null,null,null,null,"Vozidlo"]
[null,"2020-01-02","Odjezd",null,null,"10:00:00",null,null,{"$f":"IF(G5=\"VV\",ROUND(H5*$Z$14+H5*$Z$18,2),\"\")","v":""},null,{"$f":"R26","v":691},null,null,{"$f":"(N(I5)+J5+L5+M5)","v":0},null,null,{"$f":"VLOOKUP(P27,$AC$12:$AG$16,Q27+1,FALSE)","v":91},null,null,{"$f":"IF(B5=\"\",\"\",IF(B7=\"\",\"konec\",\"průběh\"))","v":"průběh"},{"$f":"VLOOKUP(IF(B5=\"\",0,(IF(B5=B3,1000,100)+IF(B5=B7,10,1))),List1!$B$22:$D$26,3,FALSE)","v":4},{"$f":"B5","v":"2020-01-02"},{"$f":"IF(V5<>0,B5+F5,\"\")","v":"2020-01-02T10:00:00"},null,"SPZ"]
[null,null,"Příjezd",null,null,"12:00:00",null,null,null,null,null,null,null,null,null,null,null,null,null,null,null,{"$f":"B5","v":"2020-01-02"},{"$f":"IF(V5<>0,B5+F6,\"\")","v":"2020-01-02T12:00:00"},null,"Palivo","nafta",null,null,null,{"$f":"AD8","v":43832}]
[null,"2020-01-05","Odjezd",null,null,"15:00:00",null,null,{"$f":"IF(G7=\"VV\",ROUND(H7*$Z$14+H7*$Z$18,2),\"\")","v":""},null,null,null,null,{"$f":"(N(I7)+J7+L7+M7)","v":0},null,null,{"$f":"VLOOKUP(P28,$AC$12:$AG$16,Q28+1,FALSE)","v":200},null,null,{"$f":"IF(B7=\"\",\"\",IF(B9=\"\",\"konec\",\"průběh\"))","v":"konec"},{"$f":"VLOOKUP(IF(B7=\"\",0,(IF(B7=B5,1000,100)+IF(B7=B9,10,1))),List1!$B$22:$D$26,3,FALSE)","v":4},{"$f":"B7","v":"2020-01-05"},{"$f":"IF(V7<>0,B7+F7,\"\")","v":"2020-01-05T15:00:00"},null,"spotřeba 1",3.1]
[null,null,"Příjezd",null,null,"20:00:00",null,null,null,null,null,null,null,null,null,null,null,null,null,null,null,{"$f":"B7","v":"2020-01-05"},{"$f":"IF(V7<>0,B7+F8,\"\")","v":"2020-01-05T20:00:00"},null,"spotřeba 2",null,null,null,null,{"$f":"MIN(B5:B20)","v":"2020-01-02"},{"$f":"MIN(W5:W20)","v":"2020-01-02T10:00:00"}]
[null,null,"Odjezd",null,null,null,null,null,{"$f":"IF(G9=\"VV\",ROUND(H9*$Z$14+H9*$Z$18,2),\"\")","v":""},null,null,null,null,{"$f":"(N(I9)+J9+L9+M9)","v":0},null,null,null,null,null,{"$f":"IF(B9=\"\",\"\",IF(B11=\"\",\"konec\",\"průběh\"))","v":""},{"$f":"VLOOKUP(IF(B9=\"\",0,(IF(B9=B7,1000,100)+IF(B9=B11,10,1))),List1!$B$22:$D$26,3,FALSE)","v":5},{"$f":"B9","v":"00:00:00"},{"$f":"IF(V9<>0,B9+F9,\"\")","v":""},null,"spotřeba 3",null,null,null,null,{"$f":"MAX(B5:B20)","v":"2020-01-05"},{"$f":"MAX(W5:W20)","v":"2020-01-05T20:00:00"}]
[null,null,"Příjezd",null,null,null,null,null,null,null,null,null,null,null,null,null,null,null,null,null,null,{"$f":"B9","v":"00:00:00"},{"$f":"IF(V9<>0,B9+F10,\"\")","v":""},null,"spotřeba 4"]
[null,null,"Odjezd",null,null,null,null,null,{"$f":"IF(G11=\"VV\",ROUND(H11*$Z$14+H11*$Z$18,2),\"\")","v":""},null,null,null,null,{"$f":"(N(I11)+J11+L11+M11)","v":0},null,null,null,null,null,{"$f":"IF(B11=\"\",\"\",IF(B13=\"\",\"konec\",\"průběh\"))","v":""},{"$f":"VLOOKUP(IF(B11=\"\",0,(IF(B11=B9,1000,100)+IF(B11=B13,10,1))),List1!$B$22:$D$26,3,FALSE)","v":5},{"$f":"B11","v":"00:00:00"},{"$f":"IF(V11<>0,B11+F11,\"\")","v":""},null,"Průměr - použitá spotřeba",{"$f":"ROUND(AVERAGE(Z7:Z10),2)","v":3.1},null,null,null,"0 - 5 hod","5 až 12 hod.","12 až 18 hod.","více než 18 hod."]
[null,null,"Příjezd",null,null,null,null,null,null,null,null,null,null,null,null,null,null,null,null,null,null,{"$f":"B11","v":"00:00:00"},{"$f":"IF(V11<>0,B11+F12,\"\")","v":""},null,"Cena paliva z dokladu",null,"Pokud nezadáte cenu paliva z dokladu, bude použita cena z vyhlášky",null,"počet jídel",0,"I","II","III"]
[null,null,"Odjezd",null,null,null,null,null,{"$f":"IF(G13=\"VV\",ROUND(H13*$Z$14+H13*$Z$18,2),\"\")","v":""},null,null,null,null,{"$f":"(N(I13)+J13+L13+M13)","v":0},null,null,null,null,null,{"$f":"IF(B13=\"\",\"\",IF(B15=\"\",\"konec\",\"průběh\"))","v":""},{"$f":"VLOOKUP(IF(B13=\"\",0,(IF(B13=B11,1000,100)+IF(B13=B15,10,1))),List1!$B$22:$D$26,3,FALSE)","v":5},{"$f":"B13","v":"00:00:00"},{"$f":"IF(V13<>0,B13+F13,\"\")","v":""},null,"Náhrady",null,null,null,0,0,90,140,200]
[null,null,"Příjezd",null,null,null,null,null,null,null,null,null,null,null,null,null,null,null,null,null,null,{"$f":"B13","v":"00:00:00"},{"$f":"IF(V13<>0,B13+F14,\"\")","v":""},null,"amortizace za km",4.0999999999999996,null,null,1,0,{"$f":"AE13*0.3","v":27},{"$f":"0.65*AF13","v":91},{"$f":"0.75*AG13","v":150}]
[null,null,"Odjezd",null,null,null,null,null,{"$f":"IF(G15=\"VV\",ROUND(H15*$Z$14+H15*$Z$18,2),\"\")","v":""},null,null,null,null,{"$f":"(N(I15)+J15+L15+M15)","v":0},null,null,null,null,null,{"$f":"IF(B15=\"\",\"\",IF(B17=\"\",\"konec\",\"průběh\"))","v":""},{"$f":"VLOOKUP(IF(B15=\"\",0,(IF(B15=B13,1000,100)+IF(B15=B17,10,1))),List1!$B$22:$D$26,3,FALSE)","v":5},{"$f":"B15","v":"00:00:00"},{"$f":"IF(V15<>0,B15+F15,\"\")","v":""},null,"benzin 95 oktanů",33.1,null,null,2,0,0,{"$f":"0.3*AF13","v":42},{"$f":"0.5*AG13","v":100}]
{"$rows_left_out":42}
{"sheet":"Vyúčtování","index":2,"n_rows":60,"n_cols":44,"rows_kept":60,"cut":false,"hidden":false,"merged":[[59,5,61,9],[59,1,61,3],[55,1,56,3],[7,37,9,49],[25,3,25,4],[37,1,37,6],[38,1,39,4],[41,1,43,8],[46,1,47,8],[20,1,23,2],[20,3,20,4],[24,1,25,2],[15,5,15,6],[16,1,16,2],[28,1,28,6],[29,1,29,6],[0,35,0,36],[55,5,56,8],[33,1,35,8],[19,10,19,13],[50,1,51,3],[50,5,50,8],[28,35,28,37],[7,6,7,10],[6,30,7,30],[9,1,9,3],[6,31,7,31],[9,6,9,10],[9,17,9,18],[4,31,5,31],[4,30,5,30],[8,17,8,18],[5,6,5,10],[13,1,13,3],[15,9,15,11],[16,9,16,11],[8,1,8,3],[11,7,11,8],[16,5,16,6],[15,1,15,2],[3,1,3,3],[3,4,3,10],[26,1,27,2],[19,1,19,2],[21,9,22,9],[26,3,26,4],[27,3,27,4],[23,3,23,4],[19,3,19,4],[21,3,21,4],[22,3,22,4],[8,6,8,11],[24,3,24,4],[18,1,18,13],[24,10,24,13],[6,1,6,3],[0,8,0,13],[30,1,30,6],[1,1,1,13],[3,12,3,13],[11,1,11,3],[7,1,7,3],[10,1,10,3],[4,12,4,13],[4,1,4,3],[4,4,4,10],[6,6,6,10],[5,12,6,13],[9,12,9,13],[8,12,8,13],[2,1,2,3],[2,4,2,10]]}
[null,null,null,null,null,null,null,null,"Příloha OD  č. 2/2020",null,null,null,null,null,null,null,null,null,null,null,null,null,null,null,null,null,null,null,null,null,null,null,null,{"$f":"60*60*24","v":86400}]
[null,"VYÚČTOVÁNÍ ZAHRANIČNÍ PRACOVNÍ CESTY",null,null,null,null,null,null,null,null,null,null,null,null,null,null,null,null,null,null,null,null,null,null,null,null,{"$f":"\"Kurzy ČNB jsou aktualizovány k \"&TEXT(MAX('Kurzy CNB'!A2:A460),\"dd.mm.rrrr\")","v":"Kurzy ČNB jsou aktualizovány k 17.05.2021"}]
[null,"Jméno a příjmení"]
[null,"Název akce",null,null,null,null,null,null,null,null,null,null,"stát",null,null,null,null,null,null,null,null,null,null,null,null,null,null,null,null,null,null,null,null,null,null,"Vozidlo"]
[null,"Místo akce",null,null,null,null,null,null,null,null,null,null,"Německo",null,null,null,null,null,null,null,null,null,null,null,null,null,null,null,null,null,null,null,null,null,null,"SPZ"]
[null,null,null,null,"datum","čas","místo",null,null,null,null,null,"základní sazba zahraničního stravného",null,null,null,null,null,null,null,null,null,null,null,null,null,null,null,null,null,null,null,null,null,null,"Palivo","benzin 95 oktanů",null,null,null,{"$f":"AO8","v":0}]
[null,"Zahájení cesty",null,null,"2021-01-05","08:00:00",null,null,null,null,null,null,null,null,null,null,null,{"$f":"E7+F7","v":"2021-01-05T08:00:00"},null,null,null,null,null,null,null,null,null,null,null,null,null,null,null,null,null,"spotřeba 1",10,"Doplňte kombinovanou spotřebu dle norem EU z TP a ostatní pole ponechte prázdné"]
[null,"Překročení státní hranice/odlet",null,null,"2021-01-05","08:00:00",{"$f":"IF(R8<R7,\"překročení hranice nemůže být před začátkem cesty\",\"\")","v":""},null,null,null,null,null,{"$f":"VLOOKUP(M5,List1!V3:Y180,4,FALSE)","v":45},{"$f":"VLOOKUP(M5,List1!V3:Y180,2,FALSE)","v":"EUR"},null,null,null,{"$f":"E8+F8","v":"2021-01-05T08:00:00"},null,null,null,null,null,null,null,null,null,null,null,null,null,null,null,null,null,"spotřeba 2",null,"Pokud údaj o kombinované spotřebě v technickém průkazu není, vypočte se spotřeba PHM vozidla aritmetickým průměrem ze všech údajů o spotřebě uvedených v technickém průkazu."]
[null,"Překročení státní hranice/přílet",null,null,"2021-01-10","08:00:00",{"$f":"IF(OR(E7>MAX('Kurzy CNB'!A2:A460),E16>MAX('Kurzy CNB'!A2:A460)),\"Začátek cesty nebo datum zálohy je v období mimo načtené kurzy ČNB\",\"\")","v":""},null,null,null,null,null,"použit kurz ze dne",null,null,null,null,{"$f":"E9+F9","v":"2021-01-10T08:00:00"},null,null,null,null,null,null,null,null,null,null,null,null,null,null,null,null,null,"spotřeba 3"]
[null,"Ukončení cesty",null,null,"2021-01-10","08:00:00",null,null,null,null,null,null,{"$f":"IF(AND(E16<>\"\",E14<>\"NE\",OR(F16<>\"\",F17<>\"\")),E16,E7)","v":"2021-01-05"},null,null,null,null,{"$f":"E10+F10","v":"2021-01-10T08:00:00"},null,null,null,null,null,null,null,null,null,null,null,null,null,null,null,null,null,"spotřeba 4"]
[null,"Strava poskytnuta bezplatně",null,null,"ano",null,"Celková vzdálenost v km  při použití VV",null,null,null,null,null,null,null,null,null,null,null,null,null,null,null,null,null,null,null,null,null,null,null,null,null,null,null,null,"Průměr - použitá spotřeba",{"$f":"ROUND(AVERAGE(AK7:AK10),2)","v":10},null,null,null,"0 - 5 hod","5 až 12 hod.","12 až 18 hod.","více než 18 hod."]
[null,"Použitý dopr. prostředek",null,null,"V",null,null,{"$f":"IF(E12=\"VV\",CEILING(G12*$AK$16+G12*$AK$21,0.01),\"\")","v":""},null,null,null,null,null,null,null,null,null,null,null,null,null,null,null,null,null,null,null,null,null,null,null,null,null,null,null,"Cena paliva z dokladu",null,"EUR",null,"počet jídel",0,"I","II","III"]
[null,null,null,null,null,null,null,null,null,null,null,null,null,null,null,null,null,null,null,null,null,null,null,null,null,null,null,null,null,null,null,null,null,null,null,"Cena paliva z dokladu CZK",{"$f":"CEILING(IF(AK12<>\"\",IF(AL12<>\"\",(IF(AL12=\"CZK\",1,VLOOKUP($M$10,'Kurzy CNB'!$A$1:$AH$156,VLOOKUP(AL12,List1!$S$4:$T$36,2,FALSE),TRUE)))*AK12/VLOOKUP(AL12,List1!$S$3:$U$36,3,FALSE),0),0),0.0001)","v":0},null,null,0,0,100,150,220]
[null,"Poskytnuta záloha",null,null,"ne",null,"částka","měna","kurz ČNB",null,null,null,null,null,null,null,null,null,null,null,null,null,null,null,null,null,null,null,null,null,null,null,null,null,null,"Náhrady",null,null,null,1,0,{"$f":"AP13*0.3","v":30},{"$f":"0.65*AQ13","v":97.5},{"$f":"0.75*AR13","v":165}]
[]
{"$rows_left_out":46}
{"sheet":"Kurzy CNB","index":3,"n_rows":95,"n_cols":34,"rows_kept":95,"cut":false,"hidden":false,"merged":[]}
["Datum","1 AUD","1 BGN","1 BRL","1 CAD","1 CHF","1 CNY","1 DKK","1 EUR","1 GBP","1 HKD","1 HRK","100 HUF","1000 IDR","1 ILS","100 INR","100 ISK","100 JPY","100 KRW","1 MXN","1 MYR","1 NOK","1 NZD","100 PHP","1 PLN","1 RON","100 RUB","1 SEK","1 SGD","100 THB","1 TRY","1 USD","1 XDR","1 ZAR"]
["2021-01-04",16.411000000000001,13.365,4.1340000000000003,16.734999999999999,24.181000000000001,3.2890000000000001,3.5139999999999998,26.14,28.99,2.742,3.46,7.2359999999999998,1.53,6.63,29.111999999999998,16.724,20.646000000000001,1.962,1.0760000000000001,5.306,2.5030000000000001,15.319000000000001,44.262,5.7480000000000002,5.367,28.927,2.5910000000000002,16.138000000000002,71.162000000000006,2.8860000000000001,21.259,30.619,1.4590000000000001]
["2021-01-05",16.463000000000001,13.407999999999999,4.0019999999999998,16.759,24.273,3.306,3.5249999999999999,26.225000000000001,29.03,2.7559999999999998,3.4689999999999999,7.2789999999999999,1.536,6.6769999999999996,29.181000000000001,16.8,20.77,1.9630000000000001,1.0660000000000001,5.32,2.5049999999999999,15.391999999999999,44.429000000000002,5.7670000000000003,5.3819999999999997,28.611000000000001,2.6080000000000001,16.206,71.292000000000002,2.891,21.369,30.959,1.4239999999999999]
["2021-01-06",16.516999999999999,13.369,4.0149999999999997,16.710999999999999,24.164000000000001,3.2829999999999999,3.5139999999999998,26.145,28.849,2.7330000000000001,3.4590000000000001,7.3040000000000003,1.5249999999999999,6.6550000000000002,28.984000000000002,16.727,20.585999999999999,1.952,1.073,5.2839999999999998,2.5190000000000001,15.451000000000001,44.091999999999999,5.7889999999999997,5.3659999999999997,28.779,2.597,16.093,70.847999999999999,2.8879999999999999,21.190999999999999,30.683,1.4119999999999999]
["2021-01-07",16.509,13.367000000000001,4.0129999999999999,16.757999999999999,24.138000000000002,3.294,3.5150000000000001,26.145,28.992000000000001,2.7469999999999999,3.4550000000000001,7.3079999999999998,1.5309999999999999,6.6959999999999997,29.036000000000001,16.835000000000001,20.565999999999999,1.948,1.0780000000000001,5.2750000000000004,2.528,15.465,44.284999999999997,5.8049999999999997,5.367,28.67,2.5990000000000002,16.088000000000001,70.938999999999993,2.9060000000000001,21.298999999999999,30.899000000000001,1.391]
["2021-01-08",16.606999999999999,13.378,3.9809999999999999,16.835000000000001,24.167000000000002,3.3050000000000002,3.5179999999999998,26.164999999999999,29.039000000000001,2.7549999999999999,3.456,7.2759999999999998,1.5229999999999999,6.7119999999999997,29.135999999999999,16.826000000000001,20.559000000000001,1.956,1.069,5.2969999999999997,2.5430000000000001,15.505000000000001,44.378999999999998,5.8,5.3719999999999999,28.815999999999999,2.6030000000000002,16.126000000000001,71.016999999999996,2.907,21.359000000000002,30.87,1.3979999999999999]
["2021-01-11",16.622,13.417,3.9420000000000002,16.872,24.210999999999999,3.33,3.528,26.24,29.077000000000002,2.782,3.4620000000000002,7.274,1.5269999999999999,6.7839999999999998,29.364999999999998,16.702999999999999,20.7,1.964,1.07,5.3239999999999998,2.5299999999999998,15.507,44.866,5.7939999999999996,5.3879999999999999,28.895,2.6040000000000001,16.218,71.587999999999994,2.8980000000000001,21.574000000000002,31.178000000000001,1.395]
["2021-01-12",16.635999999999999,13.391,3.9329999999999998,16.89,24.222999999999999,3.3330000000000002,3.5209999999999999,26.19,29.285,2.7770000000000001,3.4540000000000002,7.282,1.524,6.8129999999999997,29.396999999999998,16.766999999999999,20.664000000000001,1.96,1.0780000000000001,5.3070000000000004,2.524,15.46,44.817999999999998,5.7880000000000003,5.3760000000000003,29.077999999999999,2.5960000000000001,16.221,71.477000000000004,2.8769999999999998,21.535,31.015999999999998,1.3979999999999999]
["2021-01-13",16.635999999999999,13.384,4.0350000000000001,16.898,24.207999999999998,3.3260000000000001,3.5179999999999998,26.175000000000001,29.414000000000001,2.7749999999999999,3.4529999999999998,7.266,1.53,6.851,29.407,16.779,20.702000000000002,1.96,1.0840000000000001,5.32,2.532,15.439,44.765000000000001,5.7830000000000004,5.3719999999999999,29.151,2.5819999999999999,16.218,71.620999999999995,2.891,21.515000000000001,31.001000000000001,1.405]
["2021-01-14",16.744,13.39,4.0999999999999996,17.032,24.24,3.3410000000000002,3.52,26.19,29.448,2.786,3.4609999999999999,7.2830000000000004,1.5369999999999999,6.875,29.54,16.724,20.754000000000001,1.9690000000000001,1.089,5.3529999999999998,2.54,15.541,44.978999999999999,5.7720000000000002,5.3739999999999997,29.398,2.5920000000000001,16.277999999999999,71.951999999999998,2.927,21.603999999999999,31.155999999999999,1.4219999999999999]
["2021-01-15",16.683,13.374000000000001,4.1059999999999999,16.968,24.289000000000001,3.3330000000000002,3.516,26.16,29.391999999999999,2.7829999999999999,3.4630000000000001,7.2670000000000003,1.5389999999999999,6.6139999999999999,29.510999999999999,16.725999999999999,20.802,1.962,1.089,5.3449999999999998,2.5369999999999999,15.481999999999999,44.924999999999997,5.7649999999999997,5.3680000000000003,29.38,2.5819999999999999,16.242000000000001,71.84,2.899,21.577000000000002,31.108000000000001,1.417]
["2021-01-18",16.657,13.387,4.0970000000000004,16.988,24.364000000000001,3.3420000000000001,3.52,26.184999999999999,29.396999999999998,2.8,3.468,7.2649999999999997,1.5429999999999999,6.7110000000000003,29.611000000000001,16.7,20.917999999999999,1.9610000000000001,1.0920000000000001,5.3570000000000002,2.5209999999999999,15.423999999999999,45.155999999999999,5.77,5.3719999999999999,29.224,2.5790000000000002,16.286999999999999,72.012,2.8919999999999999,21.706,31.265000000000001,1.4159999999999999]
["2021-01-19",16.638000000000002,13.375,4.0960000000000001,16.939,24.29,3.3290000000000002,3.516,26.16,29.36,2.7810000000000001,3.4580000000000002,7.2969999999999997,1.5329999999999999,6.6440000000000001,29.474,16.661999999999999,20.736000000000001,1.956,1.1000000000000001,5.3239999999999998,2.5299999999999998,15.371,44.908000000000001,5.7679999999999998,5.367,29.248999999999999,2.5910000000000002,16.233000000000001,71.813000000000002,2.8969999999999998,21.562000000000001,31.058,1.444]
["2021-01-20",16.678000000000001,13.359,4.0579999999999998,16.992999999999999,24.234000000000002,3.3380000000000001,3.512,26.125,29.507999999999999,2.786,3.4540000000000002,7.31,1.5389999999999999,6.6360000000000001,29.571000000000002,16.619,20.798999999999999,1.9590000000000001,1.099,5.3390000000000004,2.5310000000000001,15.398999999999999,44.959000000000003,5.7640000000000002,5.36,29.321999999999999,2.577,16.276,72.006,2.9,21.594000000000001,31.094000000000001,1.4430000000000001]
["2021-01-21",16.689,13.343,4.07,17.001999999999999,24.225000000000001,3.3220000000000001,3.508,26.094999999999999,29.446999999999999,2.7690000000000001,3.45,7.3010000000000002,1.5329999999999999,6.56,29.408000000000001,16.641999999999999,20.756,1.9510000000000001,1.0940000000000001,5.3250000000000002,2.5449999999999999,15.481999999999999,44.673000000000002,5.7619999999999996,5.3540000000000001,29.11,2.5880000000000001,16.228000000000002,71.703000000000003,2.9140000000000001,21.460999999999999,30.911000000000001,1.4510000000000001]
{"$rows_left_out":81}
{"sheet":"List1","index":4,"n_rows":180,"n_cols":25,"rows_kept":180,"cut":false,"hidden":true,"merged":[]}
[null,null,null,null,null,null,null,"2021-01-01",null,null,null,null,null,null,null,"počet dní"]
[1,null,null,null,null,null,null,"2021-12-31",null,null,"ano","JE",null,"ZO PF UK",null,{"$f":"Příkaz!F14-Příkaz!F6+1","v":1},{"$f":"VALUE(RIGHT(P2,1))","v":1},{"$f":"P2&\" \"&VLOOKUP(Q2,P6:Q15,2,FALSE)","v":"1 den"},null,null,null,"Země","Měnový kód","Měna","Základní sazby zahraničního stravného"]
[2,"V","Vlak",null,null,null,null,null,null,null,"ne","NENÍ",null,"jinak",null,null,null,"CZK","CZK",0,1,"Afghánistán","EUR","euro",45]
[3,"A","Autobus",null,null,null,null,null,"CZK",null,null,null,null,null,null,null,null,"EUR","AUD",2,1,"Albánie","EUR","euro",40]
[4,"L","Letadlo",null,null,null,null,null,"EUR",null,"Ne",null,null,null,null,null,null,"GBP","BGN",3,1,"Alžírsko","EUR","euro",45]
[5,"SV","Služební silniční vozidlo",null,null,null,null,null,"USD",null,"Ano, v hotovosti",null,null,"ZO PF UK",null,0,"dní","PLN","BRL",4,1,"Andorra","EUR","euro",45]
[6,"SJ","Spolujízda",null,null,null,null,null,"GBP",null,"Ano, na bank. účet",null,null,"vyjíždějící",null,1,"den","USD","CAD",5,1,"Angola","USD","americký dolar",60]
[7,"VV","Vlastní silniční vozidlo - náhrada za každý km jízdy",null,null,null,null,null,"AUD",null,null,null,null,null,null,2,"dny",null,"CHF",6,1,"Argentina","USD","americký dolar",50]
[8,"V - VV","Vlastní vozidlo s náhradou výdajů za vlak",null,null,null,null,null,"BRL",null,null,null,null,null,null,3,"dny",null,"CNY",7,1,"Arménie","EUR","euro",35]
[9,"A - VV","Vlastní vozidlo s náhradou výdajů za autobus",null,null,null,null,null,"BGN",null,null,null,null,null,null,4,"dny",null,"DKK",8,1,"Austrálie a Oceánie – ostrovní státy1) ","USD","americký dolar",60]
[10,"L - VV","Vlastní vozidlo s náhradou výdajů za letadlo",null,null,null,null,null,"CNY",null,null,null,null,null,null,5,"dní",null,"EUR",9,1,"Ázerbájdžán","EUR","euro",40]
[11,null,null,null,null,null,null,null,"DKK",null,null,null,null,null,null,6,"dní",null,"GBP",10,1,"Bahamy","USD","americký dolar",55]
[12,"S",null,null,null,null,null,null,"PHP",null,null,null,null,null,null,7,"dní",null,"HKD",11,1,"Bahrajn","EUR","euro",45]
[13,"O",null,null,null,null,null,null,"HKD",null,null,null,null,null,null,8,"dní",null,"HRK",12,1,"Bangladéš","USD","americký dolar",50]
[14,"V",null,null,null,null,null,null,"HRK",null,null,null,null,null,null,9,"dní",null,"HUF",13,100,"Belgie","EUR","euro",50]
{"$rows_left_out":165}