{"text_format":"1","workbook":"xlsx","n_sheets":6,"sheets":["Příkaz","Vyúčtování test","Vyúčtování","Zpráva o cestě","Kurzy CNB","List1"],"not_rendered":{"charts":0,"images":1,"macros":1,"external_links":1,"defined_names":5,"comments":3,"pivot_tables":0},"unopened":[],"bounds":{"document_bytes":16777216,"sheet_cells":100000,"rows_first":2000,"rows_last":500,"rows_between":2000,"halvings":0,"cell_chars":16384,"cell_head_chars":4096},"cells_cut":0,"cells_raw":0,"read":"whole","date_system":"1900"}

{"sheet":"Příkaz","index":0,"n_rows":79,"n_cols":26,"rows_kept":79,"cut":false,"hidden":false,"merged":[[0,10,0,17],[25,3,25,15],[3,1,3,2],[3,3,3,9],[3,11,3,17],[5,5,5,6],[5,7,5,8],[5,9,5,17],[13,1,13,2],[13,5,13,6],[13,7,13,8],[1,1,1,17],[7,1,7,2],[7,3,7,17],[9,3,9,17],[11,1,11,3],[13,9,13,17],[15,3,15,17],[15,1,15,2],[17,1,17,5],[19,1,19,15],[33,1,33,2],[33,3,33,5],[17,8,17,12],[17,13,17,15],[23,1,23,2],[25,1,25,2],[21,1,21,9],[21,10,21,17],[29,1,29,3],[29,5,29,17],[27,3,27,15],[27,1,27,2],[23,3,23,15],[49,1,49,6],[49,7,49,8],[58,9,58,17],[57,1,57,3],[39,5,39,17],[39,1,39,2],[41,5,41,17],[43,1,43,2],[43,5,43,7],[43,9,43,10],[43,11,43,17],[47,1,47,3],[47,5,47,17],[45,13,45,17],[45,9,45,12],[51,2,52,17],[53,2,53,17],[55,1,55,17],[78,1,78,7],[70,1,70,7],[70,10,70,17],[74,10,74,17],[78,10,78,17],[74,1,74,7],[60,1,67,17],[58,1,58,3],[9,1,9,2],[33,23,33,24],[45,1,45,4],[45,5,45,8],[31,10,31,15],[37,1,38,17],[31,6,31,8],[41,1,41,2],[36,1,36,17],[34,14,34,17],[33,14,33,17],[31,1,31,5],[34,3,34,5],[11,4,11,17],[33,9,33,10],[33,6,33,8]]}
[null,null,null,null,null,null,null,null,null,null,"Příloha OD  č. 1/2022\n\nEvidenční číslo:"]
[null,"CESTOVNÍ  PŘÍKAZ K USKUTEČNĚNÍ ZAHRANIČNÍ PRACOVNÍ CESTY"]
[]
[null,"Jméno a příjmení:",null,null,null,null,null,null,null,null,"Útvar:"]
[]
[null,"Zahájení cesty",null,"Datum:",null,null,null,"Místo:"]
[]
[null,"Místo konání:",null,null,null,null,null,null,null,null,null,null,null,null,null,null,null,null,null,null,null,null,null,"Stát, místo, pořadatel"]
[]
[null,"Název akce/Účel:"]
{"$rows_left_out":70}
{"sheet":"Vyúčtování test","index":1,"n_rows":56,"n_cols":33,"rows_kept":56,"cut":false,"hidden":true,"merged":[[24,24,24,26],[16,19,17,19],[14,19,15,19],[12,19,13,19],[10,19,11,19],[8,19,9,19],[6,19,7,19],[8,1,9,1],[8,3,8,4],[8,6,9,6],[8,7,9,7],[8,9,9,9],[8,8,9,8],[18,10,19,10],[18,11,19,11],[14,13,15,13],[12,1,13,1],[12,11,13,11],[14,11,15,11],[14,12,15,12],[14,17,15,17],[15,3,15,4],[12,8,13,8],[10,1,11,1],[4,1,5,1],[4,3,4,4],[4,6,5,6],[4,7,5,7],[4,9,5,9],[6,1,7,1],[6,3,6,4],[6,6,7,6],[6,7,7,7],[6,9,7,9],[6,8,7,8],[55,9,56,17],[44,1,44,8],[48,9,48,17],[46,1,47,8],[49,9,49,17],[23,7,23,10],[34,1,34,4],[41,1,41,4],[51,1,51,5],[55,1,55,5],[30,1,31,4],[29,5,30,8],[31,7,31,8],[24,10,24,13],[14,8,15,8],[10,17,11,17],[18,13,19,13],[18,17,19,17],[5,3,5,4],[6,13,7,13],[6,17,7,17],[8,10,9,10],[8,11,9,11],[8,12,9,12],[8,13,9,13],[8,17,9,17],[9,3,9,4],[6,12,7,12],[7,3,7,4],[4,8,5,8],[6,10,7,10],[6,11,7,11],[11,3,11,4],[10,3,10,4],[10,6,11,6],[10,7,11,7],[10,9,11,9],[10,8,11,8],[4,20,5,20],[6,20,7,20],[8,20,9,20],[10,20,11,20],[12,20,13,20],[4,10,5,10],[4,11,5,11],[4,12,5,12],[4,13,5,13],[4,17,5,17],[4,19,5,19],[10,10,11,10],[10,11,11,11],[10,12,11,12],[10,13,11,13],[14,20,15,20],[16,20,17,20],[1,1,1,17],[2,1,3,1],[2,3,3,4],[2,6,3,6],[2,7,3,7],[2,8,3,8],[12,12,13,12],[16,12,17,12],[12,13,13,13],[12,17,13,17],[13,3,13,4],[14,1,15,1],[14,3,14,4],[14,6,15,6],[14,7,15,7],[14,9,15,9],[14,10,15,10],[12,3,12,4],[12,6,13,6],[12,7,13,7],[12,9,13,9],[12,10,13,10],[18,20,19,20],[16,13,17,13],[16,17,17,17],[17,3,17,4],[18,1,19,1],[18,3,18,4],[18,6,19,6],[18,7,19,7],[18,9,19,9],[16,6,17,6],[16,7,17,7],[16,9,17,9],[16,10,17,10],[16,11,17,11],[18,19,19,19],[18,12,19,12],[19,3,19,4],[16,8,17,8],[18,8,19,8],[16,1,17,1],[16,3,16,4]]}
[]
[null,"VYÚČTOVÁNÍ PRACOVNÍ CESTY"]
[null,"Datum",null,"Odjezd - příjezd",null,null,"Použitý dopr. prostředek2)","Vzdálenost\nv km 1)","Jízdné v případě AUV","Jízdné a místní přeprava","Stravné","Noc-\nležné","Nutné\nvedlejší výdaje","Celkem",null,null,null,"Upraveno"]
[null,null,null,null,null,"v hod.",null,null,null,"Kč","Kč","Kč","Kč","Kč",null,null,null,"Kč",null,null,null,null,null,null,"Vozidlo"]
[null,"2020-01-02","Odjezd",null,null,"10:00:00",null,null,{"$f":"IF(G5=\"VV\",ROUND(H5*$Z$14+H5*$Z$18,2),\"\")","v":""},null,{"$f":"R26","v":691},null,null,{"$f":"(N(I5)+J5+L5+M5)","v":0},null,null,{"$f":"VLOOKUP(P27,$AC$12:$AG$16,Q27+1,FALSE)","v":91},null,null,{"$f":"IF(B5=\"\",\"\",IF(B7=\"\",\"konec\",\"průběh\"))","v":"průběh"},{"$f":"VLOOKUP(IF(B5=\"\",0,(IF(B5=B3,1000,100)+IF(B5=B7,10,1))),List1!$B$22:$D$26,3,FALSE)","v":4},{"$f":"B5","v":"2020-01-02"},{"$f":"IF(V5<>0,B5+F5,\"\")","v":"2020-01-02T10:00:00"},null,"SPZ"]
[null,null,"Příjezd",null,null,"12:00:00",null,null,null,null,null,null,null,null,null,null,null,null,null,null,null,{"$f":"B5","v":"2020-01-02"},{"$f":"IF(V5<>0,B5+F6,\"\")","v":"2020-01-02T12:00:00"},null,"Palivo","nafta",null,null,null,{"$f":"AD8","v":43832}]
[null,"2020-01-05","Odjezd",null,null,"15:00:00",null,null,{"$f":"IF(G7=\"VV\",ROUND(H7*$Z$14+H7*$Z$18,2),\"\")","v":""},null,null,null,null,{"$f":"(N(I7)+J7+L7+M7)","v":0},null,null,{"$f":"VLOOKUP(P28,$AC$12:$AG$16,Q28+1,FALSE)","v":200},null,null,{"$f":"IF(B7=\"\",\"\",IF(B9=\"\",\"konec\",\"průběh\"))","v":"konec"},{"$f":"VLOOKUP(IF(B7=\"\",0,(IF(B7=B5,1000,100)+IF(B7=B9,10,1))),List1!$B$22:$D$26,3,FALSE)","v":4},{"$f":"B7","v":"2020-01-05"},{"$f":"IF(V7<>0,B7+F7,\"\")","v":"2020-01-05T15:00:00"},null,"spotřeba 1",3.1]
[null,null,"Příjezd",null,null,"20:00:00",null,null,null,null,null,null,null,null,null,null,null,null,null,null,null,{"$f":"B7","v":"2020-01-05"},{"$f":"IF(V7<>0,B7+F8,\"\")","v":"2020-01-05T20:00:00"},null,"spotřeba 2",null,null,null,null,{"$f":"MIN(B5:B20)","v":"2020-01-02"},{"$f":"MIN(W5:W20)","v":"2020-01-02T10:00:00"}]
[null,null,"Odjezd",null,null,null,null,null,{"$f":"IF(G9=\"VV\",ROUND(H9*$Z$14+H9*$Z$18,2),\"\")","v":""},null,null,null,null,{"$f":"(N(I9)+J9+L9+M9)","v":0},null,null,null,null,null,{"$f":"IF(B9=\"\",\"\",IF(B11=\"\",\"konec\",\"průběh\"))","v":""},{"$f":"VLOOKUP(IF(B9=\"\",0,(IF(B9=B7,1000,100)+IF(B9=B11,10,1))),List1!$B$22:$D$26,3,FALSE)","v":5},{"$f":"B9","v":"00:00:00"},{"$f":"IF(V9<>0,B9+F9,\"\")","v":""},null,"spotřeba 3",null,null,null,null,{"$f":"MAX(B5:B20)","v":"2020-01-05"},{"$f":"MAX(W5:W20)","v":"2020-01-05T20:00:00"}]
[null,null,"Příjezd",null,null,null,null,null,null,null,null,null,null,null,null,null,null,null,null,null,null,{"$f":"B9","v":"00:00:00"},{"$f":"IF(V9<>0,B9+F10,\"\")","v":""},null,"spotřeba 4"]
{"$rows_left_out":47}
{"sheet":"Vyúčtování","index":2,"n_rows":60,"n_cols":46,"rows_kept":60,"cut":false,"hidden":false,"merged":[[0,45,0,49],[6,26,9,28],[0,8,0,14],[30,1,30,6],[1,1,1,14],[3,13,3,14],[11,1,11,3],[7,1,7,3],[10,1,10,3],[4,13,4,14],[4,1,4,3],[4,4,4,10],[6,6,6,10],[5,13,6,14],[9,13,9,14],[8,13,8,14],[26,1,27,2],[19,1,19,2],[21,9,22,9],[26,3,26,4],[27,3,27,4],[23,3,23,4],[19,3,19,4],[21,3,21,4],[22,3,22,4],[24,3,24,4],[2,1,2,3],[2,4,2,10],[3,1,3,3],[3,4,3,10],[8,6,8,12],[28,36,28,38],[7,6,7,10],[6,31,7,31],[9,1,9,3],[6,32,7,32],[9,6,9,10],[9,18,9,19],[20,1,23,2],[24,1,25,2],[16,1,16,2],[28,1,28,6],[19,10,19,14],[24,10,24,14],[6,1,6,3],[13,1,13,3],[8,1,8,3],[7,38,9,50],[25,3,25,4],[20,3,20,4],[15,5,15,6],[10,10,10,14],[15,12,15,14],[11,7,11,8],[16,5,16,6],[18,1,18,14],[15,1,15,2],[15,9,15,10],[16,9,16,10],[59,5,61,9],[59,1,61,3],[55,1,56,3],[46,1,47,8],[4,32,5,32],[4,31,5,31],[8,18,8,19],[55,5,56,8],[33,1,35,8],[50,1,51,3],[50,5,50,8],[37,1,37,6],[38,1,39,4],[41,1,43,8],[29,1,29,6],[5,6,5,10]]}
[null,null,null,null,null,null,null,null,"Příloha OD  č. 1/2022",null,null,null,null,null,null,null,null,null,null,null,null,null,null,null,null,null,null,{"$f":"\"Kurzy ČNB jsou aktualizovány k \"&TEXT(MAX('Kurzy CNB'!$A$2:$A$400),\"dd.mm.rrrr\")","v":"Kurzy ČNB jsou aktualizovány k 17.02.2022"},null,null,null,null,null,null,{"$f":"60*60*24","v":86400},null,null,null,null,null,null,null,null,null,null,{"$f":"IFERROR(\"Vyúčtování pracovní cesty a zprávu o pracovní cestě je nutné odevzdat nejpozději do \" &TEXT(List1!$AC$1,\"dd.mm.rrrr\")&\".\",\"\")","v":""}]
[null,"VYÚČTOVÁNÍ ZAHRANIČNÍ PRACOVNÍ CESTY"]
[null,"Jméno a příjmení",null,null,{"$f":"T(Příkaz!D4)","v":""}]
[null,"Název akce/Účel:",null,null,{"$f":"T(Příkaz!D10)","v":""},null,null,null,null,null,null,null,null,"stát",null,null,null,null,null,null,null,null,null,null,null,null,null,null,null,null,null,null,null,null,null,null,"Vozidlo"]
[null,"Místo konání akce",null,null,{"$f":"T(Příkaz!D8)","v":""},null,null,null,null,null,null,null,null,"Německo",null,null,null,null,null,null,null,null,null,null,null,null,null,null,null,null,null,null,null,null,null,null,"SPZ"]
[null,null,null,null,"datum","čas","místo",null,null,null,null,null,null,"základní sazba zahraničního stravného",null,null,null,null,null,null,null,null,null,null,null,null,null,null,null,null,null,null,null,null,null,null,"Palivo","benzin 95 oktanů",null,null,null,{"$f":"AP8","v":0}]
[null,"Zahájení cesty",null,null,"2022-01-03","12:00:00",null,null,null,null,null,null,null,null,null,null,null,null,{"$f":"E7+F7","v":"2022-01-03T12:00:00"},null,null,null,null,null,null,null,"Neposkytnutí náhrady cestovních výdajů\n dle čl.15 OD 1/2022 v případě, že byla zaměstnanci poskytnuta náhrada v zahraničí nebo z jiného zdroje",null,null,null,null,null,null,null,null,null,"spotřeba 1",2,"Doplňte kombinovanou spotřebu dle norem EU z TP a ostatní pole ponechte prázdné"]
[null,"Překročení státní hranice/odlet",null,null,"2022-01-03","12:00:00",{"$f":"IF(S8<S7,\"překročení hranice nemůže být před začátkem cesty\",\"\")","v":""},null,null,null,null,null,null,{"$f":"VLOOKUP(N5,List1!V3:Y180,4,FALSE)","v":45},{"$f":"VLOOKUP(N5,List1!V3:Y180,2,FALSE)","v":"EUR"},null,null,null,{"$f":"E8+F8","v":"2022-01-03T12:00:00"},null,null,null,null,null,null,null,null,null,null,null,null,null,null,null,null,null,"spotřeba 2",null,"Pokud údaj o kombinované spotřebě v technickém průkazu není, vypočte se spotřeba PHM vozidla aritmetickým průměrem ze všech údajů o spotřebě uvedených v technickém průkazu."]
[null,"Překročení státní hranice/přílet",null,null,"2022-01-03","13:00:00",{"$f":"IF(OR(E7>MAX('Kurzy CNB'!A2:A400),E16>MAX('Kurzy CNB'!A2:A400)),\"Začátek cesty nebo datum zálohy je v období mimo načtené kurzy ČNB\",\"\")","v":""},null,null,null,null,null,null,"použit kurz ze dne",null,null,null,null,{"$f":"E9+F9","v":"2022-01-03T13:00:00"},null,null,null,null,null,null,null,null,null,null,null,null,null,null,null,null,null,"spotřeba 3"]
[null,"Ukončení cesty",null,null,"2022-01-03","13:00:00",null,null,null,null,null,null,null,{"$f":"IF(AND(E16<>\"\",E14<>\"NE\",OR(F16<>\"\",F17<>\"\")),E16,E7)","v":"2022-01-03"},null,null,null,null,{"$f":"E10+F10","v":"2022-01-03T13:00:00"},null,null,null,null,null,null,null,null,null,null,null,null,null,null,null,null,null,"spotřeba 4"]
{"$rows_left_out":51}
{"sheet":"Zpráva o cestě","index":3,"n_rows":53,"n_cols":21,"rows_kept":53,"cut":false,"hidden":false,"merged":[[1,20,5,28],[7,8,7,16],[13,8,13,17],[0,10,0,15],[1,1,1,17],[3,1,3,4],[3,5,3,17],[5,1,5,4],[5,5,5,17],[52,1,52,3],[52,9,52,16],[7,5,7,6],[13,5,13,6],[19,10,19,16],[15,7,15,17],[17,1,17,6],[17,7,17,17],[19,1,19,5],[19,7,19,8],[22,1,22,5],[7,1,7,4],[9,1,9,4],[9,5,9,17],[11,5,11,17],[13,1,13,4],[15,1,15,3],[15,5,15,6],[23,1,31,16],[34,1,48,16],[51,1,51,3]]}
[null,null,null,null,null,null,null,null,null,null,"Příloha OD  č. 1/2022\n\n"]
[null,"ZPRÁVA O PRŮBĚHU A VÝSLEDCÍCH  PRACOVNÍ CESTY",null,null,null,null,null,null,null,null,null,null,null,null,null,null,null,null,null,null,{"$f":"IFERROR(\"Vyúčtování pracovní cesty a zprávu o pracovní cestě je nutné odevzdat nejpozději do \" &TEXT(List1!$AC$1,\"dd.mm.rrrr\")&\".\",\"\")","v":""}]
[]
[null,"Jméno a příjmení:",null,null,null,{"$f":"T(Příkaz!D4)","v":""}]
[]
[null,"Útvar, katedra:",null,null,null,{"$f":"T(Příkaz!L4)","v":""}]
[]
[null,"Datum a místo zahájení cesty:",null,null,null,{"$f":"T(Příkaz!F6)","v":""},null,null,{"$f":"T(Příkaz!J6)","v":""}]
[]
[null,"Místo konání:",null,null,null,{"$f":"T(Příkaz!D8)","v":""}]
{"$rows_left_out":44}
{"sheet":"Kurzy CNB","index":4,"n_rows":35,"n_cols":34,"rows_kept":35,"cut":false,"hidden":false,"merged":[]}
["Datum","1 AUD","1 BGN","1 BRL","1 CAD","1 CHF","1 CNY","1 DKK","1 EUR","1 GBP","1 HKD","1 HRK","100 HUF","1000 IDR","1 ILS","100 INR","100 ISK","100 JPY","100 KRW","1 MXN","1 MYR","1 NOK","1 NZD","100 PHP","1 PLN","1 RON","100 RUB","1 SEK","1 SGD","100 THB","1 TRY","1 USD","1 XDR","1 ZAR"]
["2022-01-03",15.818,12.69,3.9060000000000001,17.21,23.931000000000001,3.4409999999999998,3.3370000000000002,24.82,29.501999999999999,2.8029999999999999,3.3010000000000002,6.7510000000000003,1.532,7.0679999999999996,29.411999999999999,16.815999999999999,19.015999999999998,1.833,1.0680000000000001,5.2389999999999999,2.4809999999999999,14.901999999999999,42.756999999999998,5.4080000000000004,5.016,29.361999999999998,2.41,16.189,65.897000000000006,1.6459999999999999,21.86,30.594999999999999,1.3819999999999999]
["2022-01-04",15.784000000000001,12.654999999999999,3.8570000000000002,17.210999999999999,23.902999999999999,3.4409999999999998,3.3279999999999998,24.75,29.599,2.8149999999999999,3.2919999999999998,6.7789999999999999,1.534,7.09,29.393999999999998,16.745999999999999,18.87,1.829,1.0669999999999999,5.242,2.472,14.849,42.683,5.4189999999999996,5.0019999999999998,29.146000000000001,2.407,16.166,65.861999999999995,1.635,21.943999999999999,30.744,1.367]
["2022-01-05",15.763999999999999,12.567,3.831,17.076000000000001,23.722000000000001,3.4140000000000001,3.3050000000000002,24.58,29.425999999999998,2.7890000000000001,3.2679999999999998,6.7880000000000003,1.514,7.03,29.234000000000002,16.744,18.759,1.8160000000000001,1.0629999999999999,5.1840000000000002,2.4649999999999999,14.814,42.637,5.3819999999999997,4.97,28.696999999999999,2.3969999999999998,16.04,65.438999999999993,1.613,21.739000000000001,30.359000000000002,1.3720000000000001]
["2022-01-06",15.547000000000001,12.542,3.81,16.977,23.6,3.3980000000000001,3.2970000000000002,24.53,29.344999999999999,2.7789999999999999,3.2610000000000001,6.8170000000000002,1.506,6.96,29.117999999999999,16.71,18.719000000000001,1.8009999999999999,1.0549999999999999,5.1459999999999999,2.444,14.645,42.335000000000001,5.3780000000000001,4.9619999999999997,28.356000000000002,2.375,15.944000000000001,64.656000000000006,1.5780000000000001,21.678999999999998,30.332000000000001,1.379]
["2022-01-07",15.462,12.494999999999999,3.798,17,23.45,3.391,3.286,24.44,29.291,2.7719999999999998,3.25,6.8129999999999997,1.506,6.9550000000000001,29.097999999999999,16.739999999999998,18.667999999999999,1.796,1.0569999999999999,5.1379999999999999,2.4369999999999998,14.595000000000001,42.094000000000001,5.3719999999999999,4.9420000000000002,28.658999999999999,2.3759999999999999,15.912000000000001,64.203999999999994,1.554,21.626000000000001,30.242999999999999,1.3839999999999999]
["2022-01-10",15.444000000000001,12.456,3.8090000000000002,17.004000000000001,23.317,3.3780000000000001,3.2749999999999999,24.36,29.212,2.7610000000000001,3.2370000000000001,6.7960000000000003,1.504,6.9009999999999998,29.073,16.661999999999999,18.673999999999999,1.7969999999999999,1.056,5.125,2.4300000000000002,14.542,41.902000000000001,5.3730000000000002,4.9260000000000002,28.664000000000001,2.3639999999999999,15.877000000000001,64.022999999999996,1.5469999999999999,21.524999999999999,30.096,1.3759999999999999]
["2022-01-11",15.449,12.483000000000001,3.8210000000000002,17.035,23.25,3.379,3.2810000000000001,24.414999999999999,29.251999999999999,2.762,3.2450000000000001,6.83,1.506,6.8780000000000001,29.152999999999999,16.609000000000002,18.645,1.8049999999999999,1.0569999999999999,5.1379999999999999,2.4380000000000002,14.557,42.11,5.3719999999999999,4.9370000000000003,28.768999999999998,2.3690000000000002,15.914999999999999,64.515000000000001,1.5660000000000001,21.538,30.151,1.379]
["2022-01-12",15.494999999999999,12.486000000000001,3.847,17.126999999999999,23.285,3.375,3.282,24.42,29.302,2.754,3.246,6.8579999999999997,1.5,6.8949999999999996,29.055,16.611999999999998,18.606000000000002,1.804,1.0529999999999999,5.1289999999999996,2.4609999999999999,14.561,42.06,5.3849999999999998,4.9379999999999997,28.8,2.3809999999999998,15.898,64.39,1.556,21.47,30.065999999999999,1.391]
["2022-01-13",15.571,12.505000000000001,3.851,17.106000000000002,23.399000000000001,3.355,3.2869999999999999,24.46,29.273,2.74,3.2519999999999998,6.8849999999999998,1.4930000000000001,6.8639999999999999,28.873999999999999,16.638999999999999,18.678000000000001,1.8,1.0449999999999999,5.1100000000000003,2.4620000000000002,14.667,41.764000000000003,5.3920000000000003,4.9470000000000001,28.242000000000001,2.3889999999999998,15.856999999999999,64.296999999999997,1.571,21.34,29.916,1.3859999999999999]
{"$rows_left_out":26}
{"sheet":"List1","index":5,"n_rows":569,"n_cols":30,"rows_kept":569,"cut":false,"hidden":true,"merged":[]}
[null,null,null,null,null,null,null,"2022-01-01",null,null,null,null,null,null,null,"počet dní",null,null,null,null,null,null,null,null,null,null,null,{"$f":"Příkaz!F14","v":"00:00:00"},{"$f":"VLOOKUP(VLOOKUP(AB1,AB3:AD569,3,FALSE)+10,AA3:AB569,2,FALSE)","v":{"$error":"#N/A"}}]
[1,null,null,null,null,null,null,"2022-12-31",null,null,"ano","JE",null,"ZO PF UK",null,{"$f":"Příkaz!F14-Příkaz!F6+1","v":1},{"$f":"VALUE(RIGHT(P2,1))","v":1},{"$f":"P2&\" \"&VLOOKUP(Q2,P6:Q15,2,FALSE)","v":"1 den"},null,null,null,"Země","Měnový kód","Měna","Základní sazby zahraničního stravného",null,null,"datum","body"]
[2,"V","Vlak",null,null,null,null,null,null,null,"ne","NENÍ",null,"jinak",null,null,null,"CZK","CZK",0,1,"Afghánistán","EUR","euro",45,null,0,"2022-01-01",0]
[3,"A","Autobus",null,null,null,null,null,"CZK",null,null,null,null,null,null,null,null,"EUR","AUD",2,1,"Albánie","EUR","euro",40,null,{"$f":"AA3+AC4","v":0},"2022-01-02",0,{"$f":"AA3+AC4","v":0}]
[4,"L","Letadlo",null,null,null,null,null,"EUR",null,"Ne",null,null,null,null,null,null,"GBP","BGN",3,1,"Alžírsko","EUR","euro",50,null,1,"2022-01-03",1,{"$f":"AA4+AC5","v":1}]
[5,"SV","Služební silniční vozidlo",null,null,null,null,null,"USD",null,"Ano, v hotovosti",null,null,"ZO PF UK",null,0,"dní","PLN","BRL",4,1,"Andorra","EUR","euro",45,null,2,"2022-01-04",1,2]
[6,"SJ","Spolujízda",null,null,null,null,null,"GBP",null,"Ano, na bank. účet",null,null,"vyjíždějící",null,1,"den","USD","CAD",5,1,"Angola","USD","americký dolar",60,null,3,"2022-01-05",1,3]
[7,"VV","Vlastní silniční vozidlo - náhrada za každý km jízdy",null,null,null,null,null,"AUD",null,null,null,null,null,null,2,"dny",null,"CHF",6,1,"Argentina","USD","americký dolar",50,null,4,"2022-01-06",1,4]
[8,"V - VV","Vlastní vozidlo s náhradou výdajů za vlak",null,null,null,null,null,"BRL",null,null,null,null,null,null,3,"dny",null,"CNY",7,1,"Arménie","EUR","euro",35,null,5,"2022-01-07",1,5]
[9,"A - VV","Vlastní vozidlo s náhradou výdajů za autobus",null,null,null,null,null,"BGN",null,null,null,null,null,null,4,"dny",null,"DKK",8,1,"Austrálie a Oceánie – ostrovní státy1) ","USD","americký dolar",60,null,5,"2022-01-08",0,5]
{"$rows_left_out":559}